Reaction Details
TargetCyclin-dependent kinase 4
LigandBDBM50110183
Substrate/Competitorn/a
Meas. Tech.ChEMBL_2260098 (CHEMBL5215109)
IC50 2.0±n/a nM
Citation Bass, AKAEl-Zoghbi, MSNageeb, EMMohamed, MFABadr, MAbuo-Rahma, GEA Comprehensive review for anticancer hybridized multitargeting HDAC inhibitors. Eur J Med Chem209:0 (2021) 
 
Cyclin-dependent kinase 4
Name:Cyclin-dependent kinase 4
Type:Enzyme Subunit
Mol. Mass.:33731.96
Organism:Homo sapiens (Human)
Description:P11802
Residue:303
BDBM50110183
NameBDBM50110183
Synonyms:Abemaciclib US10626107, Example LY2835219 US10696678, Example LY2835219 US11053238, LY2835219 US11351170, Example Abemaciclib
TypeSmall organic molecule
Emp. Form.C27H32F2N8
Mol. Mass.506.5934
SMILESCCN1CCN(Cc2ccc(Nc3ncc(F)c(n3)-c3cc(F)c4nc(C)n(C(C)C)c4c3)nc2)CC1