Reaction Details
TargetPhosphatidylinositol 4,5-bisphosphate 3-kinase catalytic subunit gamma isoform
LigandBDBM50527615
Substrate/Competitorn/a
Meas. Tech.ChEMBL_2260104 (CHEMBL5215115)
IC50 9.0±n/a nM
Citation Bass, AKAEl-Zoghbi, MSNageeb, EMMohamed, MFABadr, MAbuo-Rahma, GEA Comprehensive review for anticancer hybridized multitargeting HDAC inhibitors. Eur J Med Chem209:0 (2021) 
 
Phosphatidylinositol 4,5-bisphosphate 3-kinase catalytic subunit gamma isoform
Name:Phosphatidylinositol 4,5-bisphosphate 3-kinase catalytic subunit gamma isoform
Type:Enzyme Subunit
Mol. Mass.:126470.30
Organism:Homo sapiens (Human)
Description:P48736
Residue:1102
BDBM50527615
NameBDBM50527615
Synonyms:CHEMBL4455923
TypeSmall organic molecule
Emp. Form.C31H29N9O3
Mol. Mass.575.6205
SMILESCC[C@H](Nc1nc(N)nc(C)c1C#N)c1nc2cccc(NCc3ccc(cc3)C(=O)NO)c2c(=O)n1-c1ccccc1