Reaction Details
TargetKappa-type opioid receptor
LigandBDBM50189143
Substrate/Competitorn/a
Meas. Tech.ChEMBL_396128 (CHEMBL910349)
Ki>10000±n/a nM
Citation Béguin, CRichards, MRLi, JGWang, YXu, WLiu-Chen, LYCarlezon, WACohen, BM Synthesis and in vitro evaluation of salvinorin A analogues: effect of configuration at C(2) and substitution at C(18). Bioorg Med Chem Lett16:4679-85 (2006) 
 
Kappa-type opioid receptor
Name:Kappa-type opioid receptor
Type:G Protein-Coupled Receptor (GPCR)
Mol. Mass.:42648.76
Organism:Homo sapiens (Human)
Description:P41145
Residue:380
BDBM50189143
NameBDBM50189143
Synonyms:(2S,4aS,6aR,7R,9S,10aS,10bR)-7-(ethylcarbamoyl)-2-(furan-3-yl)-6a,10b-dimethyl-4,10-dioxo-dodecahydro-1H-benzo[f]isochromen-9-yl acetate | CHEMBL410682
TypeSmall organic molecule
Emp. Form.C24H31NO7
Mol. Mass.445.5054
SMILESCCNC(=O)[C@@H]1C[C@H](OC(C)=O)C(=O)[C@H]2[C@@]1(C)CC[C@@H]1C(=O)O[C@@H](C[C@]21C)c1ccoc1