Reaction Details
TargetKappa-type opioid receptor
LigandBDBM50189146
Substrate/Competitorn/a
Meas. Tech.ChEMBL_396128 (CHEMBL910349)
Ki 1000±n/a nM
Citation Béguin, CRichards, MRLi, JGWang, YXu, WLiu-Chen, LYCarlezon, WACohen, BM Synthesis and in vitro evaluation of salvinorin A analogues: effect of configuration at C(2) and substitution at C(18). Bioorg Med Chem Lett16:4679-85 (2006) 
 
Kappa-type opioid receptor
Name:Kappa-type opioid receptor
Type:G Protein-Coupled Receptor (GPCR)
Mol. Mass.:42648.76
Organism:Homo sapiens (Human)
Description:P41145
Residue:380
BDBM50189146
NameBDBM50189146
Synonyms:(2S,4aR,6aS,7R,9S,10aS)-2-(furan-3-yl)-7-(hydroxymethyl)-6a,10b-dimethyl-5,10-dioxo-dodecahydro-1H-benzo[f]isochromen-9-yl acetate | CHEMBL215938
TypeSmall organic molecule
Emp. Form.C22H28O7
Mol. Mass.404.4535
SMILESCC(=O)O[C@H]1C[C@@H](CO)[C@]2(C)CC(=O)[C@H]3CO[C@@H](CC3(C)[C@H]2C1=O)c1ccoc1