Reaction Details
TargetKappa-type opioid receptor
LigandBDBM50189139
Substrate/Competitorn/a
Meas. Tech.ChEMBL_396129 (CHEMBL910350)
EC50 339±n/a nM
Citation Béguin, CRichards, MRLi, JGWang, YXu, WLiu-Chen, LYCarlezon, WACohen, BM Synthesis and in vitro evaluation of salvinorin A analogues: effect of configuration at C(2) and substitution at C(18). Bioorg Med Chem Lett16:4679-85 (2006) 
 
Kappa-type opioid receptor
Name:Kappa-type opioid receptor
Type:G Protein-Coupled Receptor (GPCR)
Mol. Mass.:42648.76
Organism:Homo sapiens (Human)
Description:P41145
Residue:380
BDBM50189139
NameBDBM50189139
Synonyms:(2S,4aR,6aR,7R,9R,10aS,10bR)-methyl 9-acetamido-2-(furan-3-yl)-6a,10b-dimethyl-4,10-dioxo-dodecahydro-1H-benzo[f]isochromene-7-carboxylate | CHEMBL213399
TypeSmall organic molecule
Emp. Form.C23H29NO7
Mol. Mass.431.4789
SMILESCOC(=O)[C@@H]1C[C@@H](NC(C)=O)C(=O)[C@H]2[C@@]1(C)CC[C@H]1C(=O)O[C@@H](C[C@]21C)c1ccoc1