Reaction Details
TargetProtein-S-isoprenylcysteine O-methyltransferase
LigandBDBM50189239
Substrate/Competitorn/a
Meas. Tech.ChEMBL_380404 (CHEMBL864903)
IC50 14300±n/a nM
Citation Donelson, JLHodges, HBMacdougall, DDHenriksen, BSHrycyna, CAGibbs, RA Amide-substituted farnesylcysteine analogs as inhibitors of human isoprenylcysteine carboxyl methyltransferase. Bioorg Med Chem Lett16:4420-3 (2006) 
 
Protein-S-isoprenylcysteine O-methyltransferase
Name:Protein-S-isoprenylcysteine O-methyltransferase
Type:PROTEIN
Mol. Mass.:31943.26
Organism:Homo sapiens (Human)
Description:ChEMBL_956034
Residue:284
BDBM50189239
NameBDBM50189239
Synonyms:(R)-2-(3,5-dinitrobenzamido)-3-(3,7,11-trimethyldodeca-2,6,10-trienylthio)propanoic acid | CHEMBL212599
TypeSmall organic molecule
Emp. Form.C25H33N3O7S
Mol. Mass.519.61
SMILES[#6]\[#6](-[#6])=[#6]\[#6]-[#6]\[#6](-[#6])=[#6]\[#6]-[#6]\[#6](-[#6])=[#6]\[#6]-[#16]-[#6]-[#6@H](-[#7]-[#6](=O)-c1cc(cc(c1)-[#7+](-[#8-])=O)-[#7+](-[#8-])=O)-[#6](-[#8])=O