Reaction Details
TargetProtein-S-isoprenylcysteine O-methyltransferase
LigandBDBM50189241
Substrate/Competitorn/a
Meas. Tech.ChEMBL_380404 (CHEMBL864903)
IC50 16600±n/a nM
Citation Donelson, JLHodges, HBMacdougall, DDHenriksen, BSHrycyna, CAGibbs, RA Amide-substituted farnesylcysteine analogs as inhibitors of human isoprenylcysteine carboxyl methyltransferase. Bioorg Med Chem Lett16:4420-3 (2006) 
 
Protein-S-isoprenylcysteine O-methyltransferase
Name:Protein-S-isoprenylcysteine O-methyltransferase
Type:PROTEIN
Mol. Mass.:31943.26
Organism:Homo sapiens (Human)
Description:ChEMBL_956034
Residue:284
BDBM50189241
NameBDBM50189241
Synonyms:(R)-2-(4-nitrobenzamido)-3-(3,7,11-trimethyldodeca-2,6,10-trienylthio)propanoic acid | CHEMBL209434
TypeSmall organic molecule
Emp. Form.C25H34N2O5S
Mol. Mass.474.613
SMILES[#6]\[#6](-[#6])=[#6]\[#6]-[#6]\[#6](-[#6])=[#6]\[#6]-[#6]\[#6](-[#6])=[#6]\[#6]-[#16]-[#6]-[#6@H](-[#7]-[#6](=O)-c1ccc(cc1)-[#7+](-[#8-])=O)-[#6](-[#8])=O