Reaction Details
TargetSodium-dependent dopamine transporter
LigandBDBM50189571
Substrate/Competitorn/a
Meas. Tech.ChEMBL_395402 (CHEMBL908067)
Ki 2.94±n/a nM
Citation Zeng, FJarkas, NOwens, MJKilts, CDNemeroff, CBGoodman, MM Synthesis and monoamine transporter affinity of front bridged tricyclic 3beta-(4'-halo or 4'-methyl)phenyltropanes bearing methylene or carbomethoxymethylene on the bridge to the 2beta-position. Bioorg Med Chem Lett16:4661-3 (2006) 
 
Sodium-dependent dopamine transporter
Name:Sodium-dependent dopamine transporter
Type:Multi-pass membrane protein
Mol. Mass.:68497.11
Organism:Homo sapiens (Human)
Description:Q01959
Residue:620
BDBM50189571
NameBDBM50189571
Synonyms:CHEMBL383873 | [3-(4-bromo-phenyl)-7-aza-tricyclo[5.3.0.0*4,8*]dec-(5E)-ylidene]-acetic acid methyl ester
TypeSmall organic molecule
Emp. Form.C18H20BrNO2
Mol. Mass.362.261
SMILESCOC(=O)\C=C1\CN2C3CCC2C1C(C3)c1ccc(Br)cc1