Reaction Details
TargetPhosphatidylinositol 4,5-bisphosphate 3-kinase catalytic subunit delta isoform
LigandBDBM50189750
Substrate/Competitorn/a
Meas. Tech.ChEMBL_367676 (CHEMBL871588)
IC50>5000±n/a nM
Citation Pomel, VKlicic, JCovini, DChurch, DDShaw, JPRoulin, KBurgat-Charvillon, FValognes, DCamps, MChabert, CGillieron, CFrançon, BPerrin, DLeroy, DGretener, DNichols, AVitte, PACarboni, SRommel, CSchwarz, MKRückle, T Furan-2-ylmethylene thiazolidinediones as novel, potent, and selective inhibitors of phosphoinositide 3-kinase gamma. J Med Chem49:3857-71 (2006) 
 
Phosphatidylinositol 4,5-bisphosphate 3-kinase catalytic subunit delta isoform
Name:Phosphatidylinositol 4,5-bisphosphate 3-kinase catalytic subunit delta isoform
Type:Enzyme Subunit
Mol. Mass.:119489.41
Organism:Homo sapiens (Human)
Description:O00329
Residue:1044
BDBM50189750
NameBDBM50189750
Synonyms:5-[5-(2-hydroxyphenyl)furan-2-ylmethylene]thiazolidine-2, 4-dione | CHEMBL208652
TypeSmall organic molecule
Emp. Form.C14H9NO4S
Mol. Mass.287.291
SMILESOC1=NC(=O)C(S1)=Cc1ccc(o1)-c1ccccc1O