Reaction Details
TargetPhosphatidylinositol 4,5-bisphosphate 3-kinase catalytic subunit gamma isoform
LigandBDBM50189758
Substrate/Competitorn/a
Meas. Tech.ChEMBL_367672 (CHEMBL871582)
IC50 530±n/a nM
Citation Pomel, VKlicic, JCovini, DChurch, DDShaw, JPRoulin, KBurgat-Charvillon, FValognes, DCamps, MChabert, CGillieron, CFrançon, BPerrin, DLeroy, DGretener, DNichols, AVitte, PACarboni, SRommel, CSchwarz, MKRückle, T Furan-2-ylmethylene thiazolidinediones as novel, potent, and selective inhibitors of phosphoinositide 3-kinase gamma. J Med Chem49:3857-71 (2006) 
 
Phosphatidylinositol 4,5-bisphosphate 3-kinase catalytic subunit gamma isoform
Name:Phosphatidylinositol 4,5-bisphosphate 3-kinase catalytic subunit gamma isoform
Type:Enzyme Subunit
Mol. Mass.:126470.30
Organism:Homo sapiens (Human)
Description:P48736
Residue:1102
BDBM50189758
NameBDBM50189758
Synonyms:3-[5-(2,4-dioxothiazolidin-5-ylidenemethyl)furan-2-yl]-4-hydroxybenzoic acid | CHEMBL208696
TypeSmall organic molecule
Emp. Form.C15H9NO6S
Mol. Mass.331.3
SMILESOC(=O)c1ccc(O)c(c1)-c1ccc(\C=C2/SC(=O)NC2=O)o1