Reaction Details
TargetAdenosine receptor A3
LigandBDBM50189810
Substrate/Competitorn/a
Meas. Tech.ChEMBL_367218 (CHEMBL865349)
Ki 0.81±n/a nM
Citation Lenzi, OColotta, VCatarzi, DVarano, FFilacchioni, GMartini, CTrincavelli, LCiampi, OVarani, KMarighetti, FMorizzo, EMoro, S 4-amido-2-aryl-1,2,4-triazolo[4,3-a]quinoxalin-1-ones as new potent and selective human A3 adenosine receptor antagonists. synthesis, pharmacological evaluation, and ligand-receptor modeling studies. J Med Chem49:3916-25 (2006) 
 
Adenosine receptor A3
Name:Adenosine receptor A3
Type:G Protein-Coupled Receptor (GPCR)
Mol. Mass.:36197.32
Organism:Homo sapiens (Human)
Description:P0DMS8
Residue:318
BDBM50189810
NameBDBM50189810
Synonyms:CHEMBL209927 | N-(1-oxo-2-phenyl-1,2-dihydro-[1,2,4]triazolo[4,3-a]quinoxalin-4-yl)-2,2-diphenylacetamide
TypeSmall organic molecule
Emp. Form.C29H21N5O2
Mol. Mass.471.5093
SMILESO=C(Nc1nc2ccccc2n2c1nn(-c1ccccc1)c2=O)C(c1ccccc1)c1ccccc1