Reaction Details
TargetEquilibrative nucleoside transporter 2
LigandBDBM50606918
Substrate/Competitorn/a
Meas. Tech.ChEMBL_2261598 (CHEMBL5216609)
IC50 1690±n/a nM
Citation Shahari, MSBDolzhenko, AV A closer look at N Eur J Med Chem241:0 (2022) 
 
Equilibrative nucleoside transporter 2
Name:Equilibrative nucleoside transporter 2
Type:PROTEIN
Mol. Mass.:50110.91
Organism:Homo sapiens (Human)
Description:ChEMBL_109695
Residue:456
BDBM50606918
NameBDBM50606918
Synonyms:CHEMBL5219061
TypeSmall organic molecule
Emp. Form.C24H24FN7
Mol. Mass.429.4927
SMILESNc1nc(CN2CCN(CC2)c2ccccc2F)nc(Nc2cccc3ccccc23)n1