Reaction Details
TargetEquilibrative nucleoside transporter 2
LigandBDBM56941
Substrate/Competitorn/a
Meas. Tech.ChEMBL_2261598 (CHEMBL5216609)
IC50 570±n/a nM
Citation Shahari, MSBDolzhenko, AV A closer look at N Eur J Med Chem241:0 (2022) 
 
Equilibrative nucleoside transporter 2
Name:Equilibrative nucleoside transporter 2
Type:PROTEIN
Mol. Mass.:50110.91
Organism:Homo sapiens (Human)
Description:ChEMBL_109695
Residue:456
BDBM56941
NameBDBM56941
Synonyms:6-[[4-(4-fluorophenyl)-1-piperazinyl]methyl]-N2-(3-methylphenyl)-1,3,5-triazine-2,4-diamine 6-[[4-(4-fluorophenyl)piperazin-1-yl]methyl]-N2-(3-methylphenyl)-1,3,5-triazine-2,4-diamine SMR000047961 cid_666635
TypeSmall organic molecule
Emp. Form.C21H24FN7
Mol. Mass.393.4606
SMILESCc1cccc(Nc2nc(N)nc(CN3CCN(CC3)c3ccc(F)cc3)n2)c1