Reaction Details
TargetEquilibrative nucleoside transporter 2
LigandBDBM50606919
Substrate/Competitorn/a
Meas. Tech.ChEMBL_2261598 (CHEMBL5216609)
IC50 77120±n/a nM
Citation Shahari, MSBDolzhenko, AV A closer look at N Eur J Med Chem241:0 (2022) 
 
Equilibrative nucleoside transporter 2
Name:Equilibrative nucleoside transporter 2
Type:PROTEIN
Mol. Mass.:50110.91
Organism:Homo sapiens (Human)
Description:ChEMBL_109695
Residue:456
BDBM50606919
NameBDBM50606919
Synonyms:CHEMBL5219347
TypeSmall organic molecule
Emp. Form.C21H24FN7O
Mol. Mass.409.46
SMILESCOc1ccc(Nc2nc(N)nc(CN3CCN(CC3)c3ccccc3F)n2)cc1