Reaction Details
TargetHeat shock protein HSP 90-alpha
LigandBDBM15381
Substrate/Competitorn/a
Meas. Tech.ChEMBL_394938 (CHEMBL908048)
EC50 1200±n/a nM
Citation Moulick, KClement, CCAguirre, JKim, JKang, YFelts, SChiosis, G Synthesis of a red-shifted fluorescence polarization probe for Hsp90. Bioorg Med Chem Lett16:4515-8 (2006) 
 
Heat shock protein HSP 90-alpha
Name:Heat shock protein HSP 90-alpha
Type:Molecular Chaperone
Mol. Mass.:84623.45
Organism:Homo sapiens (Human)
Description:P07900
Residue:732
BDBM15381
NameBDBM15381
Synonyms:8-(2-chloro-3,4,5-trimethoxybenzyl)-2-fluoro-9-pent-4-ynyl-9H-purin-6-amine CHEMBL112953 Purine-Based Inhibitor 8
TypeSmall organic molecule
Emp. Form.C20H21ClFN5O3
Mol. Mass.433.864
SMILESCOc1cc(Cc2nc3c(N)nc(F)nc3n2CCCC#C)c(Cl)c(OC)c1OC