Reaction Details
TargetCarbonic anhydrase 9
LigandBDBM50190239
Substrate/Competitorn/a
Meas. Tech.ChEMBL_400481 (CHEMBL912681)
Ki>10000±n/a nM
Citation Slawinski, FSlawinski, JKornicka, ABrzozowski, ZPomarnacka, EInnocenti, ASlawinski, ASlawinski, CT Carbonic anhydrase inhibitors. Inhibition of the cytosolic human isozymes I and II, and the transmembrane, tumor-associated isozymes IX and XII with substituted aromatic sulfonamides activatable in hypoxic tumors. Bioorg Med Chem Lett16:4846-51 (2006) 
 
Carbonic anhydrase 9
Name:Carbonic anhydrase 9
Type:Enzyme
Mol. Mass.:49669.03
Organism:Homo sapiens (Human)
Description:Catalytic domain of human cloned isozyme was used in the assay
Residue:459
BDBM50190239
NameBDBM50190239
Synonyms:CHEMBL215548 | N-benzyl-4-{[4-(benzylcarbamoyl)-5-chloro-2-sulfamoylphenyl]disulfanyl}-2-chloro-5-sulfamoylbenzamide
TypeSmall organic molecule
Emp. Form.C28H24Cl2N4O6S4
Mol. Mass.711.679
SMILESNS(=O)(=O)c1cc(C(=O)NCc2ccccc2)c(Cl)cc1SSc1cc(Cl)c(cc1S(N)(=O)=O)C(=O)NCc1ccccc1