Reaction Details
TargetCarbonic anhydrase 12
LigandBDBM10883
Substrate/Competitorn/a
Meas. Tech.ChEMBL_400482 (CHEMBL912682)
Ki 50±n/a nM
Citation Slawinski, FSlawinski, JKornicka, ABrzozowski, ZPomarnacka, EInnocenti, ASlawinski, ASlawinski, CT Carbonic anhydrase inhibitors. Inhibition of the cytosolic human isozymes I and II, and the transmembrane, tumor-associated isozymes IX and XII with substituted aromatic sulfonamides activatable in hypoxic tumors. Bioorg Med Chem Lett16:4846-51 (2006) 
 
Carbonic anhydrase 12
Name:Carbonic anhydrase 12
Type:Enzyme
Mol. Mass.:39456.00
Organism:Homo sapiens (Human)
Description:Catalytic domain of human cloned isozyme was used in the assay
Residue:354
BDBM10883
NameBDBM10883
Synonyms:4,5-dichlorobenzene-1,3-disulfonamide Dichlorophenamide Dichlorophenamide, DCP US10172837, Dichlorphenamide | sulfonamide 4
TypeSmall organic molecule
Emp. Form.C6H6Cl2N2O4S2
Mol. Mass.305.159
SMILESNS(=O)(=O)c1cc(Cl)c(Cl)c(c1)S(N)(=O)=O