Reaction Details
TargetCarbonic anhydrase 9
LigandBDBM50190244
Substrate/Competitorn/a
Meas. Tech.ChEMBL_400481 (CHEMBL912681)
Ki>10000±n/a nM
Citation Slawinski, FSlawinski, JKornicka, ABrzozowski, ZPomarnacka, EInnocenti, ASlawinski, ASlawinski, CT Carbonic anhydrase inhibitors. Inhibition of the cytosolic human isozymes I and II, and the transmembrane, tumor-associated isozymes IX and XII with substituted aromatic sulfonamides activatable in hypoxic tumors. Bioorg Med Chem Lett16:4846-51 (2006) 
 
Carbonic anhydrase 9
Name:Carbonic anhydrase 9
Type:Enzyme
Mol. Mass.:49669.03
Organism:Homo sapiens (Human)
Description:Catalytic domain of human cloned isozyme was used in the assay
Residue:459
BDBM50190244
NameBDBM50190244
Synonyms:2-(aminosulfonyl)-5-chloro-4-methylphenyl N-(phenylsulfonyl)benzenecarbohydrazonothioate | CHEMBL215454
TypeSmall organic molecule
Emp. Form.C20H18ClN3O4S3
Mol. Mass.496.023
SMILESCc1cc(c(SC(=NNS(=O)(=O)c2ccccc2)c2ccccc2)cc1Cl)S(N)(=O)=O