Reaction Details
TargetCarbonic anhydrase 2
LigandBDBM50190252
Substrate/Competitorn/a
Meas. Tech.ChEMBL_400480 (CHEMBL912680)
Ki 19.9±n/a nM
Citation Slawinski, FSlawinski, JKornicka, ABrzozowski, ZPomarnacka, EInnocenti, ASlawinski, ASlawinski, CT Carbonic anhydrase inhibitors. Inhibition of the cytosolic human isozymes I and II, and the transmembrane, tumor-associated isozymes IX and XII with substituted aromatic sulfonamides activatable in hypoxic tumors. Bioorg Med Chem Lett16:4846-51 (2006) 
 
Carbonic anhydrase 2
Name:Carbonic anhydrase 2
Type:Enzyme
Mol. Mass.:29250.71
Organism:Homo sapiens (Human)
Description:P00918
Residue:260
BDBM50190252
NameBDBM50190252
Synonyms:5-(aminosulfonyl)-N-benzyl-2-chloro-4-mercaptobenzamide | CHEMBL215291
TypeSmall organic molecule
Emp. Form.C14H13ClN2O3S2
Mol. Mass.356.848
SMILESNS(=O)(=O)c1cc(C(=O)NCc2ccccc2)c(Cl)cc1S