Reaction Details
TargetCarbonic anhydrase 1
LigandBDBM50190247
Substrate/Competitorn/a
Meas. Tech.ChEMBL_400479 (CHEMBL912679)
Ki 5100±n/a nM
Citation Slawinski, FSlawinski, JKornicka, ABrzozowski, ZPomarnacka, EInnocenti, ASlawinski, ASlawinski, CT Carbonic anhydrase inhibitors. Inhibition of the cytosolic human isozymes I and II, and the transmembrane, tumor-associated isozymes IX and XII with substituted aromatic sulfonamides activatable in hypoxic tumors. Bioorg Med Chem Lett16:4846-51 (2006) 
 
Carbonic anhydrase 1
Name:Carbonic anhydrase 1
Type:Enzyme
Mol. Mass.:28873.37
Organism:Homo sapiens (Human)
Description:P00915
Residue:261
BDBM50190247
NameBDBM50190247
Synonyms:(5-chloro-4-methyl-2-sulfamoyl-benzenesulfonyl)-acetic acid methyl ester | CHEMBL212811
TypeSmall organic molecule
Emp. Form.C10H12ClNO6S2
Mol. Mass.341.788
SMILESCOC(=O)CS(=O)(=O)c1cc(Cl)c(C)cc1S(N)(=O)=O