Reaction Details
TargetCarbonic anhydrase 2
LigandBDBM50190241
Substrate/Competitorn/a
Meas. Tech.ChEMBL_400480 (CHEMBL912680)
Ki 8.6±n/a nM
Citation Slawinski, FSlawinski, JKornicka, ABrzozowski, ZPomarnacka, EInnocenti, ASlawinski, ASlawinski, CT Carbonic anhydrase inhibitors. Inhibition of the cytosolic human isozymes I and II, and the transmembrane, tumor-associated isozymes IX and XII with substituted aromatic sulfonamides activatable in hypoxic tumors. Bioorg Med Chem Lett16:4846-51 (2006) 
 
Carbonic anhydrase 2
Name:Carbonic anhydrase 2
Type:Enzyme
Mol. Mass.:29250.71
Organism:Homo sapiens (Human)
Description:P00918
Residue:260
BDBM50190241
NameBDBM50190241
Synonyms:6-mercapto-3,4-dihydro-2H-1,2,4-benzothiadiazine-7-sulfonamide 1,1-dioxide | CHEMBL215916
TypeSmall organic molecule
Emp. Form.C7H9N3O4S3
Mol. Mass.295.359
SMILESNS(=O)(=O)c1cc2c(NCNS2(=O)=O)cc1S