Reaction Details
TargetCarbonic anhydrase 9
LigandBDBM50190253
Substrate/Competitorn/a
Meas. Tech.ChEMBL_400481 (CHEMBL912681)
Ki 1440±n/a nM
Citation Slawinski, FSlawinski, JKornicka, ABrzozowski, ZPomarnacka, EInnocenti, ASlawinski, ASlawinski, CT Carbonic anhydrase inhibitors. Inhibition of the cytosolic human isozymes I and II, and the transmembrane, tumor-associated isozymes IX and XII with substituted aromatic sulfonamides activatable in hypoxic tumors. Bioorg Med Chem Lett16:4846-51 (2006) 
 
Carbonic anhydrase 9
Name:Carbonic anhydrase 9
Type:Enzyme
Mol. Mass.:49669.03
Organism:Homo sapiens (Human)
Description:Catalytic domain of human cloned isozyme was used in the assay
Residue:459
BDBM50190253
NameBDBM50190253
Synonyms:4-chloro-2-hydrazinocarbonylmethanesulfonyl-5-methyl-benzenesulfonamide | CHEMBL387480
TypeSmall organic molecule
Emp. Form.C9H12ClN3O5S2
Mol. Mass.341.792
SMILESCc1cc(c(cc1Cl)S(=O)(=O)CC(=O)NN)S(N)(=O)=O