Reaction Details
TargetCarbonic anhydrase 9
LigandBDBM50190248
Substrate/Competitorn/a
Meas. Tech.ChEMBL_400481 (CHEMBL912681)
Ki 14.5±n/a nM
Citation Slawinski, FSlawinski, JKornicka, ABrzozowski, ZPomarnacka, EInnocenti, ASlawinski, ASlawinski, CT Carbonic anhydrase inhibitors. Inhibition of the cytosolic human isozymes I and II, and the transmembrane, tumor-associated isozymes IX and XII with substituted aromatic sulfonamides activatable in hypoxic tumors. Bioorg Med Chem Lett16:4846-51 (2006) 
 
Carbonic anhydrase 9
Name:Carbonic anhydrase 9
Type:Enzyme
Mol. Mass.:49669.03
Organism:Homo sapiens (Human)
Description:Catalytic domain of human cloned isozyme was used in the assay
Residue:459
BDBM50190248
NameBDBM50190248
Synonyms:4-chloro-2-mercapto-5-(pyrrolidine-1-carbonyl)benzenesulfonamide | CHEMBL386517
TypeSmall organic molecule
Emp. Form.C11H13ClN2O3S2
Mol. Mass.320.816
SMILESNS(=O)(=O)c1cc(C(=O)N2CCCC2)c(Cl)cc1S