Reaction Details
TargetCannabinoid receptor 1
LigandBDBM50607229
Substrate/Competitorn/a
Meas. Tech.ChEMBL_2262381 (CHEMBL5217392)
EC50 0.430000±n/a nM
Citation Callis, TBGarrett, TRMontgomery, APDanon, JJKassiou, M Recent Scaffold Hopping Applications in Central Nervous System Drug Discovery. J Med Chem65:13483-13504 (2022) 
 
Cannabinoid receptor 1
Name:Cannabinoid receptor 1
Type:G Protein-Coupled Receptor (GPCR)
Mol. Mass.:52868.96
Organism:Homo sapiens (Human)
Description:P21554
Residue:472
BDBM50607229
NameBDBM50607229
Synonyms:CHEMBL5219235
TypeSmall organic molecule
Emp. Form.C22H26FN3O
Mol. Mass.367.4597
SMILESCC(C)(NC(=O)c1nn(CCCCCF)c2ccccc12)c1ccccc1