Reaction Details
TargetAdenosine receptor A3
LigandBDBM50190441
Substrate/Competitorn/a
Meas. Tech.ChEMBL_375257 (CHEMBL867484)
Ki 0.14±n/a nM
Citation Tafi, ABernardini, CBotta, MCorelli, FAndreini, MMartinelli, AOrtore, GBaraldi, PGFruttarolo, FBorea, PATuccinardi, T Pharmacophore based receptor modeling: the case of adenosine A3 receptor antagonists. An approach to the optimization of protein models. J Med Chem49:4085-97 (2006) 
 
Adenosine receptor A3
Name:Adenosine receptor A3
Type:G Protein-Coupled Receptor (GPCR)
Mol. Mass.:36197.32
Organism:Homo sapiens (Human)
Description:P0DMS8
Residue:318
BDBM50190441
NameBDBM50190441
Synonyms:1-(8-ethyl-2-furan-2-yl-8,9b-dihydro-3H-pyrazolo[4,3-e][1,2,4]triazolo[1,5-c]pyrimidin-5-yl)-3-p-tolyl-urea | CHEMBL209992
TypeSmall organic molecule
Emp. Form.C20H20N8O2
Mol. Mass.404.4252
SMILESCCn1cc2C3NC(=NN3C(NC(=O)Nc3ccc(C)cc3)=Nc2n1)c1ccco1