Reaction Details
TargetAurora kinase A
LigandBDBM12407
Substrate/Competitorn/a
Meas. Tech.ChEMBL_420096 (CHEMBL912713)
IC50<0.10±n/a nM
Citation Lyne, PDLamb, MLSaeh, JC Accurate prediction of the relative potencies of members of a series of kinase inhibitors using molecular docking and MM-GBSA scoring. J Med Chem49:4805-8 (2006) 
 
Aurora kinase A
Name:Aurora kinase A
Type:Serine/threonine-protein kinase
Mol. Mass.:45830.98
Organism:Homo sapiens (Human)
Description:O14965
Residue:403
BDBM12407
NameBDBM12407
Synonyms:3-chloro-N-[5-({6-methoxy-7-[3-(morpholin-4-yl)propoxy]quinazolin-4-yl}amino)pyrimidin-2-yl]benzamide quinazoline deriv. 5
TypeSmall organic molecule
Emp. Form.C27H28ClN7O4
Mol. Mass.550.009
SMILESCOc1cc2c(Nc3cnc(NC(=O)c4cccc(Cl)c4)nc3)ncnc2cc1OCCCN1CCOCC1