Reaction Details
TargetAurora kinase A
LigandBDBM50192280
Substrate/Competitorn/a
Meas. Tech.ChEMBL_420096 (CHEMBL912713)
IC50 70±n/a nM
Citation Lyne, PDLamb, MLSaeh, JC Accurate prediction of the relative potencies of members of a series of kinase inhibitors using molecular docking and MM-GBSA scoring. J Med Chem49:4805-8 (2006) 
 
Aurora kinase A
Name:Aurora kinase A
Type:Serine/threonine-protein kinase
Mol. Mass.:45830.98
Organism:Homo sapiens (Human)
Description:O14965
Residue:403
BDBM50192280
NameBDBM50192280
Synonyms:4-benzyl-3-bromo-N-5-6-methoxy-7-3-morpholinopropoxy)quinazolin-4-ylamino)pyrimidin-2-yl)benzamide | CHEMBL264903
TypeSmall organic molecule
Emp. Form.C34H34BrN7O4
Mol. Mass.684.582
SMILESCOc1cc2c(Nc3cnc(NC(=O)c4ccc(Cc5ccccc5)c(Br)c4)nc3)ncnc2cc1OCCCN1CCOCC1