Reaction Details
TargetAurora kinase A
LigandBDBM12406
Substrate/Competitorn/a
Meas. Tech.ChEMBL_420096 (CHEMBL912713)
IC50 629±n/a nM
Citation Lyne, PDLamb, MLSaeh, JC Accurate prediction of the relative potencies of members of a series of kinase inhibitors using molecular docking and MM-GBSA scoring. J Med Chem49:4805-8 (2006) 
 
Aurora kinase A
Name:Aurora kinase A
Type:Serine/threonine-protein kinase
Mol. Mass.:45830.98
Organism:Homo sapiens (Human)
Description:O14965
Residue:403
BDBM12406
NameBDBM12406
Synonyms:CHEMBL206266 quinazoline deriv. 4
TypeSmall organic molecule
Emp. Form.C27H29N7O4
Mol. Mass.515.5637
SMILESCOc1cc2c(Nc3ncc(NC(=O)c4ccccc4)cn3)ncnc2cc1OCCCN1CCOCC1