Reaction Details
TargetHistone deacetylase 6
LigandBDBM19134
Substrate/Competitorn/a
Meas. Tech.ChEMBL_390147 (CHEMBL868655)
IC50 29±n/a nM
Citation Suzuki, TKouketsu, AItoh, YHisakawa, SMaeda, SYoshida, MNakagawa, HMiyata, N Highly potent and selective histone deacetylase 6 inhibitors designed based on a small-molecular substrate. J Med Chem49:4809-12 (2006) 
 
Histone deacetylase 6
Name:Histone deacetylase 6
Type:Chromatin regulator; hydrolase; repressor
Mol. Mass.:131381.51
Organism:Homo sapiens (Human)
Description:Q9UBN7
Residue:1215
BDBM19134
NameBDBM19134
Synonyms:CHEMBL213934 thiolate analogue, 16a
TypeSmall organic molecule
Emp. Form.C17H32N2O3S
Mol. Mass.344.513
SMILESCC(C)(C)OC(=O)N[C@@H](CCCCCS)C(=O)NC1CCCC1