Reaction Details
TargetSerine/threonine-protein kinase Chk1
LigandBDBM50192385
Substrate/Competitorn/a
Meas. Tech.ChEMBL_379936 (CHEMBL864856)
IC50 21±n/a nM
Citation Palmer, BDThompson, AMBooth, RJDobrusin, EMKraker, AJLee, HHLunney, EAMitchell, LHOrtwine, DFSmaill, JBSwan, LMDenny, WA 4-Phenylpyrrolo[3,4-c]carbazole-1,3(2H,6H)-dione inhibitors of the checkpoint kinase Wee1. Structure-activity relationships for chromophore modification and phenyl ring substitution. J Med Chem49:4896-911 (2006) 
 
Serine/threonine-protein kinase Chk1
Name:Serine/threonine-protein kinase Chk1
Type:Enzyme Catalytic Domain
Mol. Mass.:54443.02
Organism:Homo sapiens (Human)
Description:gi_166295192
Residue:476
BDBM50192385
NameBDBM50192385
Synonyms:9-hydroxy-4-(4-hydroxyphenyl)pyrrolo[3,4-c]carbazole-1,3(2H,6H)-dione | CHEMBL212660
TypeSmall organic molecule
Emp. Form.C20H12N2O4
Mol. Mass.344.3203
SMILESOc1ccc(cc1)-c1cc2[nH]c3ccc(O)cc3c2c2C(=O)NC(=O)c12