Reaction Details
TargetWee1-like protein kinase
LigandBDBM50192393
Substrate/Competitorn/a
Meas. Tech.ChEMBL_379935 (CHEMBL864855)
IC50 12±n/a nM
Citation Palmer, BDThompson, AMBooth, RJDobrusin, EMKraker, AJLee, HHLunney, EAMitchell, LHOrtwine, DFSmaill, JBSwan, LMDenny, WA 4-Phenylpyrrolo[3,4-c]carbazole-1,3(2H,6H)-dione inhibitors of the checkpoint kinase Wee1. Structure-activity relationships for chromophore modification and phenyl ring substitution. J Med Chem49:4896-911 (2006) 
 
Wee1-like protein kinase
Name:Wee1-like protein kinase
Type:PROTEIN
Mol. Mass.:71599.12
Organism:Homo sapiens (Human)
Description:ChEMBL_1445054
Residue:646
BDBM50192393
NameBDBM50192393
Synonyms:4-(2-chloro-3-hydroxyphenyl)-9-hydroxypyrrolo[3,4-c]carbazole-1,3(2H,6H)-dione | CHEMBL213585
TypeSmall organic molecule
Emp. Form.C20H11ClN2O4
Mol. Mass.378.765
SMILESOc1ccc2[nH]c3cc(c4C(=O)NC(=O)c4c3c2c1)-c1cccc(O)c1Cl