Reaction Details
TargetWee1-like protein kinase
LigandBDBM50192387
Substrate/Competitorn/a
Meas. Tech.ChEMBL_379935 (CHEMBL864855)
IC50 53±n/a nM
Citation Palmer, BDThompson, AMBooth, RJDobrusin, EMKraker, AJLee, HHLunney, EAMitchell, LHOrtwine, DFSmaill, JBSwan, LMDenny, WA 4-Phenylpyrrolo[3,4-c]carbazole-1,3(2H,6H)-dione inhibitors of the checkpoint kinase Wee1. Structure-activity relationships for chromophore modification and phenyl ring substitution. J Med Chem49:4896-911 (2006) 
 
Wee1-like protein kinase
Name:Wee1-like protein kinase
Type:PROTEIN
Mol. Mass.:71599.12
Organism:Homo sapiens (Human)
Description:ChEMBL_1445054
Residue:646
BDBM50192387
NameBDBM50192387
Synonyms:4-(2-chlorophenyl)-9-hydroxy-6-isopropylpyrrolo[3,4-c]carbazole-1,3(2H,6H)-dione | CHEMBL213525
TypeSmall organic molecule
Emp. Form.C23H17ClN2O3
Mol. Mass.404.846
SMILESCC(C)n1c2ccc(O)cc2c2c3C(=O)NC(=O)c3c(cc12)-c1ccccc1Cl