Reaction Details
TargetMelanin-concentrating hormone receptor 1
LigandBDBM50192518
Substrate/Competitorn/a
Meas. Tech.ChEMBL_391842 (CHEMBL863645)
IC50 7±n/a nM
Citation Ma, VBannon, AWBaumgartner, JHale, CHsieh, FHulme, CRorrer, KSalon, Jvan Staden, CTempest, P Solid-phase synthesis and structure-activity relationships of novel biarylethers as melanin-concentrating hormone receptor-1 antagonists. Bioorg Med Chem Lett16:5066-72 (2006) 
 
Melanin-concentrating hormone receptor 1
Name:Melanin-concentrating hormone receptor 1
Type:G Protein-Coupled Receptor (GPCR)
Mol. Mass.:45976.27
Organism:Homo sapiens (Human)
Description:Membranes from CHO-K1 cells stably expressing human MCH1R were used in assays.
Residue:422
BDBM50192518
NameBDBM50192518
Synonyms:1-(2-(3,4-dimethylphenoxy)-5-((2-(pyrrolidin-1-yl)ethyl)carbamoyl)phenyl)-3-phenylurea | CHEMBL216192
TypeSmall organic molecule
Emp. Form.C28H32N4O3
Mol. Mass.472.5787
SMILESCc1ccc(Oc2ccc(cc2NC(=O)Nc2ccccc2)C(=O)NCCN2CCCC2)cc1C