Reaction Details
TargetCannabinoid receptor 1
LigandBDBM50192607
Substrate/Competitorn/a
Meas. Tech.ChEMBL_422302 (CHEMBL907003)
Ki 7.7±n/a nM
Citation Huffman, JWPadgett, LWIsherwood, MLWiley, JLMartin, BR 1-Alkyl-2-aryl-4-(1-naphthoyl)pyrroles: new high affinity ligands for the cannabinoid CB1 and CB2 receptors. Bioorg Med Chem Lett16:5432-5 (2006) 
 
Cannabinoid receptor 1
Name:Cannabinoid receptor 1
Type:G Protein-Coupled Receptor (GPCR)
Mol. Mass.:52856.55
Organism:Rattus norvegicus (rat)
Description:P20272
Residue:473
BDBM50192607
NameBDBM50192607
Synonyms:(5-(2-fluorophenyl)-1-pentyl-1H-pyrrol-3-yl)(naphthalen-1-yl)methanone JWH-307
TypeSmall organic molecule
Emp. Form.C26H24FNO
Mol. Mass.385.4733
SMILESCCCCCn1cc(cc1-c1ccccc1F)C(=O)c1cccc2ccccc12