Reaction Details
TargetCannabinoid receptor 2
LigandBDBM50192589
Substrate/Competitorn/a
Meas. Tech.ChEMBL_422303 (CHEMBL907004)
Ki 3.4±n/a nM
Citation Huffman, JWPadgett, LWIsherwood, MLWiley, JLMartin, BR 1-Alkyl-2-aryl-4-(1-naphthoyl)pyrroles: new high affinity ligands for the cannabinoid CB1 and CB2 receptors. Bioorg Med Chem Lett16:5432-5 (2006) 
 
Cannabinoid receptor 2
Name:Cannabinoid receptor 2
Type:G Protein-Coupled Receptor (GPCR)
Mol. Mass.:39690.94
Organism:Homo sapiens (Human)
Description:P34972
Residue:360
BDBM50192589
NameBDBM50192589
Synonyms:(5-(2-ethylphenyl)-1-pentyl-1H-pyrrol-3-yl)(naphthalen-1-yl)methanone JWH-365
TypeSmall organic molecule
Emp. Form.C28H29NO
Mol. Mass.395.536
SMILESCCCCCn1cc(cc1-c1ccccc1CC)C(=O)c1cccc2ccccc12