Reaction Details
TargetCannabinoid receptor 2
LigandBDBM50192595
Substrate/Competitorn/a
Meas. Tech.ChEMBL_422303 (CHEMBL907004)
Ki 4±n/a nM
Citation Huffman, JWPadgett, LWIsherwood, MLWiley, JLMartin, BR 1-Alkyl-2-aryl-4-(1-naphthoyl)pyrroles: new high affinity ligands for the cannabinoid CB1 and CB2 receptors. Bioorg Med Chem Lett16:5432-5 (2006) 
 
Cannabinoid receptor 2
Name:Cannabinoid receptor 2
Type:G Protein-Coupled Receptor (GPCR)
Mol. Mass.:39690.94
Organism:Homo sapiens (Human)
Description:P34972
Residue:360
BDBM50192595
NameBDBM50192595
Synonyms:CHEMBL220180 naphthalen-1-yl(1-pentyl-5-o-tolyl-1H-pyrrol-3-yl)methanone
TypeSmall organic molecule
Emp. Form.C27H27NO
Mol. Mass.381.5094
SMILESCCCCCn1cc(cc1-c1ccccc1C)C(=O)c1cccc2ccccc12