Reaction Details
Target5-hydroxytryptamine receptor 6
LigandBDBM50193457
Substrate/Competitorn/a
Meas. Tech.ChEMBL_383814 (CHEMBL854532)
Ki 38±n/a nM
Citation Sikazwe, DBondarev, MLDukat, MRangisetty, JBRoth, BLGlennon, RA Binding of sulfonyl-containing arylalkylamines at human 5-HT6 serotonin receptors. J Med Chem49:5217-25 (2006) 
 
5-hydroxytryptamine receptor 6
Name:5-hydroxytryptamine receptor 6
Type:G Protein-Coupled Receptor (GPCR)
Mol. Mass.:46968.43
Organism:Homo sapiens (Human)
Description:P50406
Residue:440
BDBM50193457
NameBDBM50193457
Synonyms:CHEMBL212227 | N-(3-(2-(methylamino)ethyl)phenyl)benzenesulfonamide
TypeSmall organic molecule
Emp. Form.C15H18N2O2S
Mol. Mass.290.381
SMILESCNCCc1cccc(NS(=O)(=O)c2ccccc2)c1