Reaction Details
Target5-hydroxytryptamine receptor 6
LigandBDBM50193459
Substrate/Competitorn/a
Meas. Tech.ChEMBL_383814 (CHEMBL854532)
Ki 37±n/a nM
Citation Sikazwe, DBondarev, MLDukat, MRangisetty, JBRoth, BLGlennon, RA Binding of sulfonyl-containing arylalkylamines at human 5-HT6 serotonin receptors. J Med Chem49:5217-25 (2006) 
 
5-hydroxytryptamine receptor 6
Name:5-hydroxytryptamine receptor 6
Type:G Protein-Coupled Receptor (GPCR)
Mol. Mass.:46968.43
Organism:Homo sapiens (Human)
Description:P50406
Residue:440
BDBM50193459
NameBDBM50193459
Synonyms:2-(4-(benzenesulfonyl)phenyl)-1-aminoethane | CHEMBL213589
TypeSmall organic molecule
Emp. Form.C14H15NO2S
Mol. Mass.261.339
SMILESNCCc1ccc(cc1)S(=O)(=O)c1ccccc1