Reaction Details
Target5-hydroxytryptamine receptor 6
LigandBDBM50193462
Substrate/Competitorn/a
Meas. Tech.ChEMBL_383814 (CHEMBL854532)
Ki 290±n/a nM
Citation Sikazwe, DBondarev, MLDukat, MRangisetty, JBRoth, BLGlennon, RA Binding of sulfonyl-containing arylalkylamines at human 5-HT6 serotonin receptors. J Med Chem49:5217-25 (2006) 
 
5-hydroxytryptamine receptor 6
Name:5-hydroxytryptamine receptor 6
Type:G Protein-Coupled Receptor (GPCR)
Mol. Mass.:46968.43
Organism:Homo sapiens (Human)
Description:P50406
Residue:440
BDBM50193462
NameBDBM50193462
Synonyms:CHEMBL209909 | N-(3-(aminomethyl)phenyl)benzenesulfonamide
TypeSmall organic molecule
Emp. Form.C13H14N2O2S
Mol. Mass.262.327
SMILESNCc1cccc(NS(=O)(=O)c2ccccc2)c1