Reaction Details
Target5-hydroxytryptamine receptor 6
LigandBDBM50193467
Substrate/Competitorn/a
Meas. Tech.ChEMBL_383814 (CHEMBL854532)
Ki 85±n/a nM
Citation Sikazwe, DBondarev, MLDukat, MRangisetty, JBRoth, BLGlennon, RA Binding of sulfonyl-containing arylalkylamines at human 5-HT6 serotonin receptors. J Med Chem49:5217-25 (2006) 
 
5-hydroxytryptamine receptor 6
Name:5-hydroxytryptamine receptor 6
Type:G Protein-Coupled Receptor (GPCR)
Mol. Mass.:46968.43
Organism:Homo sapiens (Human)
Description:P50406
Residue:440
BDBM50193467
NameBDBM50193467
Synonyms:4-(4-benzenesulfonamidophenyl)piperazine | CHEMBL426332
TypeSmall organic molecule
Emp. Form.C16H19N3O2S
Mol. Mass.317.406
SMILESO=S(=O)(Nc1ccc(cc1)N1CCNCC1)c1ccccc1