Reaction Details
Target5-hydroxytryptamine receptor 6
LigandBDBM50193470
Substrate/Competitorn/a
Meas. Tech.ChEMBL_383814 (CHEMBL854532)
Ki 115±n/a nM
Citation Sikazwe, DBondarev, MLDukat, MRangisetty, JBRoth, BLGlennon, RA Binding of sulfonyl-containing arylalkylamines at human 5-HT6 serotonin receptors. J Med Chem49:5217-25 (2006) 
 
5-hydroxytryptamine receptor 6
Name:5-hydroxytryptamine receptor 6
Type:G Protein-Coupled Receptor (GPCR)
Mol. Mass.:46968.43
Organism:Homo sapiens (Human)
Description:P50406
Residue:440
BDBM50193470
NameBDBM50193470
Synonyms:2-(3-phenylthio)phenyl)-1-aminoethane | CHEMBL211688
TypeSmall organic molecule
Emp. Form.C14H15NS
Mol. Mass.229.341
SMILESNCCc1cccc(Sc2ccccc2)c1