Reaction Details
Target5-hydroxytryptamine receptor 6
LigandBDBM50193472
Substrate/Competitorn/a
Meas. Tech.ChEMBL_383814 (CHEMBL854532)
Ki 17±n/a nM
Citation Sikazwe, DBondarev, MLDukat, MRangisetty, JBRoth, BLGlennon, RA Binding of sulfonyl-containing arylalkylamines at human 5-HT6 serotonin receptors. J Med Chem49:5217-25 (2006) 
 
5-hydroxytryptamine receptor 6
Name:5-hydroxytryptamine receptor 6
Type:G Protein-Coupled Receptor (GPCR)
Mol. Mass.:46968.43
Organism:Homo sapiens (Human)
Description:P50406
Residue:440
BDBM50193472
NameBDBM50193472
Synonyms:CHEMBL378656 | N-(3-(2-aminoethyl)-4-methoxyphenyl)benzenesulfonamide
TypeSmall organic molecule
Emp. Form.C15H18N2O3S
Mol. Mass.306.38
SMILESCOc1ccc(NS(=O)(=O)c2ccccc2)cc1CCN