Reaction Details
Target5-hydroxytryptamine receptor 6
LigandBDBM50193473
Substrate/Competitorn/a
Meas. Tech.ChEMBL_383814 (CHEMBL854532)
Ki 38±n/a nM
Citation Sikazwe, DBondarev, MLDukat, MRangisetty, JBRoth, BLGlennon, RA Binding of sulfonyl-containing arylalkylamines at human 5-HT6 serotonin receptors. J Med Chem49:5217-25 (2006) 
 
5-hydroxytryptamine receptor 6
Name:5-hydroxytryptamine receptor 6
Type:G Protein-Coupled Receptor (GPCR)
Mol. Mass.:46968.43
Organism:Homo sapiens (Human)
Description:P50406
Residue:440
BDBM50193473
NameBDBM50193473
Synonyms:CHEMBL434365 | N-(4-(2-aminoethyl)phenyl)benzenesulfonamide
TypeSmall organic molecule
Emp. Form.C14H16N2O2S
Mol. Mass.276.354
SMILESNCCc1ccc(NS(=O)(=O)c2ccccc2)cc1