Reaction Details
TargetCathepsin B
LigandBDBM50193491
Substrate/Competitorn/a
Meas. Tech.ChEMBL_386233 (CHEMBL870447)
Ki 6900±n/a nM
Citation Korukonda, RGuan, NDalton, JTLiu, JDonkor, IO Synthesis, calpain inhibitory activity, and cytotoxicity of P2-substituted proline and thiaproline peptidyl aldehydes and peptidyl alpha-ketoamides. J Med Chem49:5282-90 (2006) 
 
Cathepsin B
Name:Cathepsin B
Type:Enzyme
Mol. Mass.:37819.69
Organism:Homo sapiens (Human)
Description:gi_63102437
Residue:339
BDBM50193491
NameBDBM50193491
Synonyms:(R)-N-(2(R,S)-3,4-dioxo-4-(phenethylamino)-1-phenylbutan-2-yl)-1-tosylpyrrolidine-2-carboxamide | CHEMBL212177
TypeSmall organic molecule
Emp. Form.C30H33N3O5S
Mol. Mass.547.665
SMILESCc1ccc(cc1)S(=O)(=O)N1CCC[C@@H]1C(=O)NC(Cc1ccccc1)C(=O)C(=O)NCCc1ccccc1