Reaction Details
TargetCathepsin B
LigandBDBM50193493
Substrate/Competitorn/a
Meas. Tech.ChEMBL_386233 (CHEMBL870447)
Ki 2470±n/a nM
Citation Korukonda, RGuan, NDalton, JTLiu, JDonkor, IO Synthesis, calpain inhibitory activity, and cytotoxicity of P2-substituted proline and thiaproline peptidyl aldehydes and peptidyl alpha-ketoamides. J Med Chem49:5282-90 (2006) 
 
Cathepsin B
Name:Cathepsin B
Type:Enzyme
Mol. Mass.:37819.69
Organism:Homo sapiens (Human)
Description:gi_63102437
Residue:339
BDBM50193493
NameBDBM50193493
Synonyms:(R)-N-((R,S)-1-oxo-3-phenylpropan-2-yl)-1-(phenylsulfonyl)-pyrrolidine-2-carboxamide | CHEMBL378494
TypeSmall organic molecule
Emp. Form.C20H22N2O4S
Mol. Mass.386.465
SMILESO=CC(Cc1ccccc1)NC(=O)[C@H]1CCCN1S(=O)(=O)c1ccccc1