Reaction Details
TargetCalpain-1 catalytic subunit
LigandBDBM50193494
Substrate/Competitorn/a
Meas. Tech.ChEMBL_386232 (CHEMBL869269)
Ki 37±n/a nM
Citation Korukonda, RGuan, NDalton, JTLiu, JDonkor, IO Synthesis, calpain inhibitory activity, and cytotoxicity of P2-substituted proline and thiaproline peptidyl aldehydes and peptidyl alpha-ketoamides. J Med Chem49:5282-90 (2006) 
 
Calpain-1 catalytic subunit
Name:Calpain-1 catalytic subunit
Type:Catalytic subunit; forms a heterodimer with a small (regulatory) subunit (CAPNS1)
Mol. Mass.:81729.82
Organism:Sus scrofa (pig)
Description:Native calpain-1 from porcine erythrocytes, purchased from Calbiochem, was used in assay.
Residue:714
BDBM50193494
NameBDBM50193494
Synonyms:(R)-1-(4-methoxyphenylsulfonyl)-N-((R,S)-1-oxo-3-phenylpropan-2-yl)pyrrolidine-2-carboxamide | CHEMBL211105
TypeSmall organic molecule
Emp. Form.C21H24N2O5S
Mol. Mass.416.491
SMILESCOc1ccc(cc1)S(=O)(=O)N1CCC[C@@H]1C(=O)NC(Cc1ccccc1)C=O