Reaction Details
TargetCalpain-1 catalytic subunit
LigandBDBM50193503
Substrate/Competitorn/a
Meas. Tech.ChEMBL_386232 (CHEMBL869269)
Ki 70±n/a nM
Citation Korukonda, RGuan, NDalton, JTLiu, JDonkor, IO Synthesis, calpain inhibitory activity, and cytotoxicity of P2-substituted proline and thiaproline peptidyl aldehydes and peptidyl alpha-ketoamides. J Med Chem49:5282-90 (2006) 
 
Calpain-1 catalytic subunit
Name:Calpain-1 catalytic subunit
Type:Catalytic subunit; forms a heterodimer with a small (regulatory) subunit (CAPNS1)
Mol. Mass.:81729.82
Organism:Sus scrofa (pig)
Description:Native calpain-1 from porcine erythrocytes, purchased from Calbiochem, was used in assay.
Residue:714
BDBM50193503
NameBDBM50193503
Synonyms:(4S)-N-(1-oxo-3-phenylpropan-2-yl)-3-tosylthiazolidine-4-carboxamide | CHEMBL211830
TypeSmall organic molecule
Emp. Form.C20H22N2O4S2
Mol. Mass.418.53
SMILESCc1ccc(cc1)S(=O)(=O)N1CSC[C@@H]1C(=O)NC(Cc1ccccc1)C=O