Reaction Details
TargetCalpain-1 catalytic subunit
LigandBDBM50193505
Substrate/Competitorn/a
Meas. Tech.ChEMBL_386232 (CHEMBL869269)
Ki 256±n/a nM
Citation Korukonda, RGuan, NDalton, JTLiu, JDonkor, IO Synthesis, calpain inhibitory activity, and cytotoxicity of P2-substituted proline and thiaproline peptidyl aldehydes and peptidyl alpha-ketoamides. J Med Chem49:5282-90 (2006) 
 
Calpain-1 catalytic subunit
Name:Calpain-1 catalytic subunit
Type:Catalytic subunit; forms a heterodimer with a small (regulatory) subunit (CAPNS1)
Mol. Mass.:81729.82
Organism:Sus scrofa (pig)
Description:Native calpain-1 from porcine erythrocytes, purchased from Calbiochem, was used in assay.
Residue:714
BDBM50193505
NameBDBM50193505
Synonyms:(R)-1-(3-nitrophenylsulfonyl)-N-((R,S)-1-oxo-3-phenylpropan-2-yl)pyrrolidine-2-carboxamide | CHEMBL386555
TypeSmall organic molecule
Emp. Form.C20H21N3O6S
Mol. Mass.431.462
SMILES[O-][N+](=O)c1cccc(c1)S(=O)(=O)N1CCC[C@@H]1C(=O)NC(Cc1ccccc1)C=O