Reaction Details
TargetCalpain-1 catalytic subunit
LigandBDBM50193492
Substrate/Competitorn/a
Meas. Tech.ChEMBL_386232 (CHEMBL869269)
Ki 450±n/a nM
Citation Korukonda, RGuan, NDalton, JTLiu, JDonkor, IO Synthesis, calpain inhibitory activity, and cytotoxicity of P2-substituted proline and thiaproline peptidyl aldehydes and peptidyl alpha-ketoamides. J Med Chem49:5282-90 (2006) 
 
Calpain-1 catalytic subunit
Name:Calpain-1 catalytic subunit
Type:Catalytic subunit; forms a heterodimer with a small (regulatory) subunit (CAPNS1)
Mol. Mass.:81729.82
Organism:Sus scrofa (pig)
Description:Native calpain-1 from porcine erythrocytes, purchased from Calbiochem, was used in assay.
Residue:714
BDBM50193492
NameBDBM50193492
Synonyms:(R)-N-(2(R,S)-3,4-dioxo-4-(phenethylamino)-1-phenylbutan-2-yl)-1-(4-methoxyphenyl-sulfonylpyrrolidine-2-carboxamide | CHEMBL215492
TypeSmall organic molecule
Emp. Form.C30H33N3O6S
Mol. Mass.563.665
SMILESCOc1ccc(cc1)S(=O)(=O)N1CCC[C@@H]1C(=O)NC(Cc1ccccc1)C(=O)C(=O)NCCc1ccccc1