Reaction Details
TargetMelanin-concentrating hormone receptor 1
LigandBDBM50193640
Substrate/Competitorn/a
Meas. Tech.ChEMBL_421230 (CHEMBL856552)
IC50 4.5±n/a nM
Citation Jiang, JLin, PHoang, MChang, LTan, CFeighner, SPalyha, OCHreniuk, DLPan, JSailer, AWMorin, NRMacNeil, DJHoward, ADVan der Ploeg, LHGoulet, MTDeVita, RJ 4-Aminoquinoline melanin-concentrating hormone 1-receptor (MCH1R) antagonists. Bioorg Med Chem Lett16:5275-9 (2006) 
 
Melanin-concentrating hormone receptor 1
Name:Melanin-concentrating hormone receptor 1
Type:G Protein-Coupled Receptor (GPCR)
Mol. Mass.:45976.27
Organism:Homo sapiens (Human)
Description:Membranes from CHO-K1 cells stably expressing human MCH1R were used in assays.
Residue:422
BDBM50193640
NameBDBM50193640
Synonyms:CHEMBL215258 | N-(4-amino-2-propylquinolin-6-yl)-4'-(trifluoromethyl)biphenyl-4-carboxamide
TypeSmall organic molecule
Emp. Form.C26H22F3N3O
Mol. Mass.449.4676
SMILESCCCc1cc(N)c2cc(NC(=O)c3ccc(cc3)-c3ccc(cc3)C(F)(F)F)ccc2n1